Target
Ectonucleotide pyrophosphatase/phosphodiesterase family member 2
Ligand
BDBM303712
Substrate
Meas. Tech.
Quanta Red Assay
IC50
9.00±n/a nM
Citation
 Blum, FCarr, JLShah, PDel Mar Jimenez Quesada, MGutierrez, IF Autotaxin inhibitors US Patent  US10138230 Publication Date 11/27/2018 
Target
Name:
Ectonucleotide pyrophosphatase/phosphodiesterase family member 2
Synonyms:
ATX Autotaxin (ATX) ENPP2 Ectonucleotide Pyrophosphatase/Phosphodiesterase 2 (ENPP2) Extracellular lysophospholipase D PDNP2
Type:
Enzyme
Mol. Mass.:
99007.13
Organism:
Homo sapiens (Human)
Description:
Q13822
Residue:
863
  
Inhibitor
Name:
BDBM303712
Synonyms:
5-[2-(4- chlorophenyl)ethyl]-N-[1- [4-[[2- methoxyethyl(methyl) amino]methyl]phenyl]-5- oxo-pyrrolidin-3-yl]- 1,3,4-thiadiazole-2- carboxamide | US10138230, Example F142
Type:
Small organic molecule
Emp. Form.:
C26H30ClN5O3S
Mol. Mass.:
528.066
SMILES:
COCCN(C)Cc1ccc(cc1)N1CC(CC1=O)NC(=O)c1nnc(CCc2ccc(Cl)cc2)s1
: