Target
Coagulation factor XI
Ligand
BDBM304179
Substrate
Meas. Tech.
Factor XIa Assay
IC50
0.470±n/a nM
Citation
 Shen, DKuang, RKumar, PDuffy, JLZhu, CAli, AYang, MDebenham, JS Factor XIa inhibitors US Patent  US10143681 Publication Date 12/4/2018 
Target
Name:
Coagulation factor XI
Synonyms:
Coagulation factor XIa Coagulation factor XIa light chain FA11_HUMAN Factor XIa PTA | Plasma thromboplastin antecedent
Type:
Enzyme
Mol. Mass.:
70130.58
Organism:
Homo sapiens (Human)
Description:
P03951
Residue:
625
  
Inhibitor
Name:
BDBM304179
Synonyms:
2-(1-((4-carboxyphenyl)amino)- 3-cyclopropyl-1-oxopropan-2- yl)-5-(3-chloro-6- (difluoromethoxy)-2- fluorophenyl)-4-methoxypyridine 1-oxide US10143681, Example 70
Type:
Small organic molecule
Emp. Form.:
C26H22ClF3N2O6
Mol. Mass.:
550.911
SMILES:
COc1cc(C(CC2CC2)C(=O)Nc2ccc(cc2)C(O)=O)[n+]([O-])cc1-c1c(F)c(Cl)ccc1OC(F)F
: