Target
Coagulation factor XI
Ligand
BDBM304191
Substrate
Meas. Tech.
Factor XIa Assay
IC50
80.0±n/a nM
Citation
 Shen, DKuang, RKumar, PDuffy, JLZhu, CAli, AYang, MDebenham, JS Factor XIa inhibitors US Patent  US10143681 Publication Date 12/4/2018 
Target
Name:
Coagulation factor XI
Synonyms:
Coagulation factor XIa Coagulation factor XIa light chain FA11_HUMAN Factor XIa PTA | Plasma thromboplastin antecedent
Type:
Enzyme
Mol. Mass.:
70130.58
Organism:
Homo sapiens (Human)
Description:
P03951
Residue:
625
  
Inhibitor
Name:
BDBM304191
Synonyms:
2-(1-((4- carboxyphenyl)amino)-3-(3- hydroxy-3- methylcyclobutyl)-1- oxopropan-2-yl)-5-(3- chloro-6-(difluoromethyl)- 2-fluorophenyl)pyridine 1- oxide US10143681, Example 83 US10143681, Example 85
Type:
Small organic molecule
Emp. Form.:
C27H24ClF3N2O5
Mol. Mass.:
548.938
SMILES:
CC1(O)CC(CC(C(=O)Nc2ccc(cc2)C(O)=O)c2ccc(c[n+]2[O-])-c2c(F)c(Cl)ccc2C(F)F)C1
: