Target
Coagulation factor XI
Ligand
BDBM304207
Substrate
Meas. Tech.
Factor XIa Assay
IC50
0.300±n/a nM
Citation
 Shen, DKuang, RKumar, PDuffy, JLZhu, CAli, AYang, MDebenham, JS Factor XIa inhibitors US Patent  US10143681 Publication Date 12/4/2018 
Target
Name:
Coagulation factor XI
Synonyms:
Coagulation factor XIa Coagulation factor XIa light chain FA11_HUMAN Factor XIa PTA | Plasma thromboplastin antecedent
Type:
Enzyme
Mol. Mass.:
70130.58
Organism:
Homo sapiens (Human)
Description:
P03951
Residue:
625
  
Inhibitor
Name:
BDBM304207
Synonyms:
2-(1-((4- carboxyphenyl)amino)-3- (2,3-dimethylcyclopropyl)- 1-oxopropan-2-yl)-5-(3- chloro-6-(difluoromethoxy)- 2-fluorophenyl)pyridine 1- oxide US10143681, Example 98 | US10143681, Example 99
Type:
Small organic molecule
Emp. Form.:
C27H24ClF3N2O5
Mol. Mass.:
548.938
SMILES:
CC1C(C)C1CC(C(=O)Nc1ccc(cc1)C(O)=O)c1ccc(c[n+]1[O-])-c1c(F)c(Cl)ccc1OC(F)F
: