Target
Glycogen synthase kinase-3 alpha
Ligand
BDBM8278
Substrate
Biotinylated Peptide Substrate
Meas. Tech.
Kinase Inhibition SPA Assay
IC50
152±n/a nM
Citation
 Smith, DGBuffet, MFenwick, AEHaigh, DIfe, RJSaunders, MSlingsby, BPStacey, RWard, RW 3-Anilino-4-arylmaleimides: potent and selective inhibitors of glycogen synthase kinase-3 (GSK-3). Bioorg Med Chem Lett 11:635-9 (2001)  
Target
Name:
Glycogen synthase kinase-3 alpha
Synonyms:
GSK-3 alpha GSK3A_HUMAN Glycogen synthase kinase-3 Glycogen synthase kinase-3 alpha (GSK3 Alpha) Glycogen synthase kinase-3 alpha (GSK3alpha)
Type:
Enzyme
Mol. Mass.:
50991.79
Organism:
Homo sapiens (Human)
Description:
P49840
Residue:
483
  
Inhibitor
Name:
BDBM8278
Synonyms:
3-{[4-(methylsulfanyl)phenyl]amino}-4-(3-nitrophenyl)-2,5-dihydro-1H-pyrrole-2,5-dione | 4-arylmaleimide deriv. 6ii
Type:
Small organic molecule
Emp. Form.:
C17H13N3O4S
Mol. Mass.:
355.368
SMILES:
CSc1ccc(NC2=C(C(=O)NC2=O)c2cccc(c2)N(=O)=O)cc1
:
Substrate
Name:
Biotinylated Peptide Substrate
Synonyms:
Type:
Peptide
Mol. Mass.:
3615.87
Organism:
Description:
Residue:
32