Target
Bile acid receptor
Ligand
BDBM306711
Substrate
Meas. Tech.
Human FXR (NR1H4) Assay
EC50
<100±n/a nM
Citation
 Or, YSXing, XShen, RWang, BGranger, BMa, JHe, JLong, JHe, YWang, G Isoxazole derivatives as FXR agonists and methods of use thereof US Patent  US10149835 Publication Date 12/11/2018 
Target
Name:
Bile acid receptor
Synonyms:
BAR FXR HRR1 NR1H4_HUMAN RIP14 Retinoid X receptor-interacting protein 14 | farnesoid x receptor
Type:
Nuclear Receptor
Mol. Mass.:
55916.24
Organism:
Homo sapiens (Human)
Description:
Q96RI1
Residue:
486
  
Inhibitor
Name:
BDBM306711
Synonyms:
US10149835, Example 2
Type:
Small organic molecule
Emp. Form.:
C31H30Cl2N4O5S2
Mol. Mass.:
673.63
SMILES:
Clc1cccc(Cl)c1-c1noc(C2CC2)c1COC1CC2CC[C@@H](C1)N2c1nc2ccc(cc2s1)C(=O)NS(=O)(=O)C1CC1
: