Target
Nuclear receptor ROR-gamma
Ligand
BDBM310098
Substrate
Meas. Tech.
TR-FRET Assay Protocol II
EC50
66.0±n/a nM
Citation
 Aicher, TDBarr, KJLapointe, BTSimov, VStein, KAThomas, WDToogood, PLVan Huis, CAWhite, CM Tetrahydronaphthyridine and related bicyclic compounds for inhibition of RORγ activity and the treatment of disease US Patent  US9657033 Publication Date 5/23/2017 
Target
Name:
Nuclear receptor ROR-gamma
Synonyms:
NR1F3 Nuclear receptor ROR-gamma (RORC) RAR-related orphan receptor C (RORc) RORG RZRG Retinoid-related orphan receptor-gamma (RORc)
Type:
Enzyme Catalytic Domain
Mol. Mass.:
58218.40
Organism:
Homo sapiens (Human)
Description:
P51449
Residue:
518
  
Inhibitor
Name:
BDBM310098
Synonyms:
2-chloro-6-fluoro-N-[1-(4-fluorobenzenesulfonyl)-2-methyl-2,3-dihydro-1H-pyrido[2,3-b][1,4]oxazin-7-yl]benzamide US9657033, Compound 12
Type:
Small organic molecule
Emp. Form.:
C21H16ClF2N3O4S
Mol. Mass.:
479.884
SMILES:
CC1COc2ncc(NC(=O)c3c(F)cccc3Cl)cc2N1S(=O)(=O)c1ccc(F)cc1
: