Target
Nuclear receptor ROR-gamma
Ligand
BDBM310137
Substrate
Meas. Tech.
TR-FRET Assay Protocol II
EC50
852±n/a nM
Citation
 Aicher, TDBarr, KJLapointe, BTSimov, VStein, KAThomas, WDToogood, PLVan Huis, CAWhite, CM Tetrahydronaphthyridine and related bicyclic compounds for inhibition of RORγ activity and the treatment of disease US Patent  US9657033 Publication Date 5/23/2017 
Target
Name:
Nuclear receptor ROR-gamma
Synonyms:
NR1F3 Nuclear receptor ROR-gamma (RORC) RAR-related orphan receptor C (RORc) RORG RZRG Retinoid-related orphan receptor-gamma (RORc)
Type:
Enzyme Catalytic Domain
Mol. Mass.:
58218.40
Organism:
Homo sapiens (Human)
Description:
P51449
Residue:
518
  
Inhibitor
Name:
BDBM310137
Synonyms:
US10377768, Compound 51 | US9657033, Compound 51
Type:
Small organic molecule
Emp. Form.:
C25H22Cl2F3N5O4S
Mol. Mass.:
616.439
SMILES:
C[C@H](N)C(=O)N[C@@H]1CN(c2cc(NC(=O)c3c(Cl)cccc3Cl)cnc2C1)S(=O)(=O)c1cccc(c1)C(F)(F)F
: