Target
Metabotropic glutamate receptor 4
Ligand
BDBM182893
Substrate
Meas. Tech.
Ca2+ Mobilization In Vitro Assay
EC50
16±n/a nM
Citation
 Biemans, BGuba, WJaeschke, GRicci, ARueher, DVieira, E Ethynyl derivatives US Patent  US9676732 Publication Date 6/13/2017 
Target
Name:
Metabotropic glutamate receptor 4
Synonyms:
GPRC1D GRM4_HUMAN MGLUR4 Metabotropic glutamate receptor 4 (mGlu4) metabotropic glutamate 4
Type:
Protein
Mol. Mass.:
101899.95
Organism:
Homo sapiens (Human)
Description:
Q14833
Residue:
912
  
Inhibitor
Name:
BDBM182893
Synonyms:
US9676732, 27 3-[2,6-Difluoro-4-(2-phenylethynyl)phenyl]-1,7-dimethyl-thieno[3,2-d]pyrimidine-2,4-dione
Type:
Small organic molecule
Emp. Form.:
C22H14F2N2O2S
Mol. Mass.:
408.421
SMILES:
Cc1csc2c1n(C)c(=O)n(-c1c(F)cc(cc1F)C#Cc1ccccc1)c2=O
: