Target
Coagulation factor XI
Ligand
BDBM313709
Substrate
Meas. Tech.
Measurement of FXIa Inhibition
IC50
390±n/a nM
Citation
 Röhrig, SJimenez Nunez, ESchlemmer, KTersteegen, ATeller, HHillisch, AHeitmeier, SSchmidt, MVAckerstaff, JStampfuß, J Substituted oxopyridine derivatives US Patent  US10167280 Publication Date 1/1/2019 
Target
Name:
Coagulation factor XI
Synonyms:
Coagulation factor XIa Coagulation factor XIa light chain FA11_HUMAN Factor XIa PTA | Plasma thromboplastin antecedent
Type:
Enzyme
Mol. Mass.:
70130.58
Organism:
Homo sapiens (Human)
Description:
P03951
Residue:
625
  
Inhibitor
Name:
BDBM313709
Synonyms:
US10167280, Example 14
Type:
Small organic molecule
Emp. Form.:
C25H21ClFN5O5
Mol. Mass.:
525.916
SMILES:
COc1cn(C(Cc2cc(C)no2)C(=O)Nc2ccc(nc2)C(N)=O)c(=O)cc1-c1cc(Cl)ccc1F
: