Target
Coagulation factor XI
Ligand
BDBM313723
Substrate
Meas. Tech.
Measurement of FXIa Inhibition
IC50
4.60±n/a nM
Citation
 Röhrig, SJimenez Nunez, ESchlemmer, KTersteegen, ATeller, HHillisch, AHeitmeier, SSchmidt, MVAckerstaff, JStampfuß, J Substituted oxopyridine derivatives US Patent  US10167280 Publication Date 1/1/2019 
Target
Name:
Coagulation factor XI
Synonyms:
Coagulation factor XIa Coagulation factor XIa light chain FA11_HUMAN Factor XIa PTA | Plasma thromboplastin antecedent
Type:
Enzyme
Mol. Mass.:
70130.58
Organism:
Homo sapiens (Human)
Description:
P03951
Residue:
625
  
Inhibitor
Name:
BDBM313723
Synonyms:
5-({2-[4-(5-Chloro-2-cyanophenyl)-5-methoxy-2-oxopyridin-1(2H)-yl]-3-(5-methyl-1,2-oxazol-3-yl)propanoyl}amino)pyridine-2-carboxamide (racemate) | US10167280, Example 28
Type:
Small organic molecule
Emp. Form.:
C26H21ClN6O5
Mol. Mass.:
532.935
SMILES:
COc1cn(C(Cc2cc(C)on2)C(=O)Nc2ccc(nc2)C(N)=O)c(=O)cc1-c1cc(Cl)ccc1C#N
: