Target
Lysine-specific demethylase 4C
Ligand
BDBM314180
Substrate
Meas. Tech.
Enzymatic Assay
IC50
550±n/a nM
Citation
 Chen, YKKanouni, TNie, ZStafford, JAVeal, JMWallace, MB Histone demethylase inhibitors US Patent  US9611221 Publication Date 4/4/2017 
Target
Name:
Lysine-specific demethylase 4C
Synonyms:
GASC-1 protein Gene amplified in squamous cell carcinoma 1 protein JMJD2C Jumonji domain-containing protein 2C KDM4C_HUMAN | KIAA0780
Type:
Protein
Mol. Mass.:
119979.01
Organism:
Homo sapiens (Human)
Description:
Q9H3R0
Residue:
1056
  
Inhibitor
Name:
BDBM314180
Synonyms:
3-({[6-(2,2,2-trifluoroethoxy)-1,2,3,4-tetrahydronaphthalen-1-yl]methyl}amino)pyridine-4-carboxylic acid US10807956, Example 90 US11639333, Example 90 US9725441, Example 90 | US9828343, Example 90
Type:
Small organic molecule
Emp. Form.:
C19H19F3N2O3
Mol. Mass.:
380.361
SMILES:
OC(=O)c1ccncc1NCC1CCCc2cc(OCC(F)(F)F)ccc12
: