Target
Baculoviral IAP repeat-containing protein 3
Ligand
BDBM314222
Substrate
Meas. Tech.
TR-FRET Assay
IC50
>54800±n/a nM
Citation
 Han, XLou, YMichoud, CMischke, SGRemiszewski, SRupert, KC Antiproliferative benzo [B] azepin-2-ones US Patent  US9611224 Publication Date 4/4/2017 
Target
Name:
Baculoviral IAP repeat-containing protein 3
Synonyms:
API2 BIRC3_HUMAN Baculoviral IAP repeat-containing protein 3 (IAP1 BIR3) MIHC XIAP-BIR3 | cIAP1/cIAP2
Type:
Protein
Mol. Mass.:
68365.75
Organism:
Homo sapiens (Human)
Description:
Q13489
Residue:
604
  
Inhibitor
Name:
BDBM314222
Synonyms:
(S)—N—{(S)-1-[2-Methoxy-6-(5-oxo-4,5-dihydro-1H-[1,2,4]triazol-3-yl)-naphthalen-1-ylmethyl]-2-oxo-2,3,4,5-tetrahydro-1H-benzo[b]azepin-3-yl}-2-methylamino-propionamide hydrochloride | US9611224, Example 34
Type:
Small organic molecule
Emp. Form.:
C28H30N6O4
Mol. Mass.:
514.5756
SMILES:
CN[C@@H](C)C(=O)N[C@H]1CCc2ccccc2N(Cc2c(OC)ccc3cc(ccc23)-c2n[nH]c(=O)[nH]2)C1=O
: