Target
Baculoviral IAP repeat-containing protein 2
Ligand
BDBM314316
Substrate
Meas. Tech.
TR-FRET Assay
IC50
32.0±n/a nM
Citation
 Han, XLou, YMichoud, CMischke, SGRemiszewski, SRupert, KC Antiproliferative benzo [B] azepin-2-ones US Patent  US9611224 Publication Date 4/4/2017 
Target
Name:
Baculoviral IAP repeat-containing protein 2
Synonyms:
API1 BIRC2_HUMAN Cellular inhibitor of apoptosis 1 MIHB | RNF48
Type:
Protein
Mol. Mass.:
69900.47
Organism:
Homo sapiens (Human)
Description:
Q13490
Residue:
618
  
Inhibitor
Name:
BDBM314316
Synonyms:
(S)-N-[(S)-1-(3-Methoxy-quinolin-4-ylmethyl)-2-oxo-2,3,4,5-tetrahydro-1H-benzo[b]azepin-3-yl]-2-methylamino-propionamide hydrochloride | US9611224, Example 47ii
Type:
Small organic molecule
Emp. Form.:
C25H28N4O3
Mol. Mass.:
432.5148
SMILES:
CN[C@@H](C)C(=O)N[C@H]1CCc2ccccc2N(Cc2c(OC)cnc3ccccc23)C1=O
: