Target
Tyrosine-protein kinase JAK3
Ligand
BDBM316750
Substrate
Meas. Tech.
JAK Caliper Enzyme Assay
IC50
0.200±n/a nM
Citation
 Thorarensen, ABrown, MFCasimiro-Garcia, AChe, YCoe, JWFlanagan, MEGilbert, AMHayward, MMLangille, JDMontgomery, JITelliez, JUnwalla, RJTrujillo, JI Pyrrolo[2,3-d]pyrimidinyl, pyrrolo[2,3-b]pyrazinyl and pyrrolo[2,3-d]pyridinyl acrylamides US Patent  US9617258 Publication Date 4/11/2017 
Target
Name:
Tyrosine-protein kinase JAK3
Synonyms:
JAK-3 JAK3_HUMAN Janus kinase 3 (JAK3) L-JAK | Leukocyte janus kinase
Type:
Protein
Mol. Mass.:
125111.08
Organism:
Homo sapiens (Human)
Description:
P52333
Residue:
1124
  
Inhibitor
Name:
BDBM316750
Synonyms:
2-[(1-acryloylpiperidin-4-yl)amino]-N-[(1S,3S)-3-fluorocyclopentyl]-5H-pyrrolo[2,3-b]pyrazine-7-carboxamide US9617258, Example 247
Type:
Small organic molecule
Emp. Form.:
C20H25FN6O2
Mol. Mass.:
400.4499
SMILES:
F[C@H]1CC[C@@H](C1)NC(=O)c1c[nH]c2ncc(NC3CCN(CC3)C(=O)C=C)nc12
: