Target
Fatty acid synthase
Ligand
BDBM183464
Substrate
Meas. Tech.
Biochemical Assay of FASN
pH
7±n/a
Temperature
298.15±n/a K
IC50
1750±n/a nM
Comments
extracted
Citation
 Tsaklakidis, CStaehle, WLeuthner, BCzodrowski, PFuchss, T 1,3-diaminocyclopentane carboxamide derivatives US Patent  US9670142 Publication Date 6/6/2017 
Target
Name:
Fatty acid synthase
Synonyms:
FAS FAS_HUMAN HU FASN
Type:
Enzyme
Mol. Mass.:
273419.37
Organism:
Homo sapiens (Human)
Description:
P49327
Residue:
2511
  
Inhibitor
Name:
BDBM183464
Synonyms:
US9670142, A50 N-[(1R,3S)-3-(cyclopropanecarbonyl-amino)-cyclopentyl]-4-(7-fluoro-benzoxazol-2-yl)-N-methyl-benzamide
Type:
Small organic molecule
Emp. Form.:
C24H24FN3O3
Mol. Mass.:
421.4641
SMILES:
CN([C@@H]1CC[C@@H](C1)NC(=O)C1CC1)C(=O)c1ccc(cc1)-c1nc2cccc(F)c2o1
: