Target
Fatty acid synthase
Ligand
BDBM186306
Substrate
Meas. Tech.
Biochemical Assay of FASN
pH
7±n/a
Temperature
298.15±n/a K
IC50
26500±n/a nM
Comments
extracted
Citation
 Tsaklakidis, CStaehle, WLeuthner, BCzodrowski, PFuchss, T 1,3-diaminocyclopentane carboxamide derivatives US Patent  US9670142 Publication Date 6/6/2017 
Target
Name:
Fatty acid synthase
Synonyms:
FAS FAS_HUMAN HU FASN
Type:
Enzyme
Mol. Mass.:
273419.37
Organism:
Homo sapiens (Human)
Description:
P49327
Residue:
2511
  
Inhibitor
Name:
BDBM186306
Synonyms:
US9670142, A147 6-(3,3-difluoro-2-oxo-2,3-dihydro-1H-indol-5-yl)-N-methyl-N-((1R,3S)-3-propionylamino-cyclopentyl)-nicotinamide
Type:
Small organic molecule
Emp. Form.:
C23H24F2N4O3
Mol. Mass.:
442.4585
SMILES:
CCC(=O)N[C@H]1CC[C@H](C1)N(C)C(=O)c1ccc(nc1)-c1ccc2NC(=O)C(F)(F)c2c1
: