Target
N-acylethanolamine-hydrolyzing acid amidase
Ligand
BDBM319810
Substrate
Meas. Tech.
Determining Endocannabinoid Hydrolase Activity
IC50
>100000±n/a nM
Citation
 Liu, ZQiu, YRen, JLi, YYang, LZhu, C Substituted heterocyclic derivative, preparation method and use thereof US Patent  US10174015 Publication Date 1/8/2019 
Target
Name:
N-acylethanolamine-hydrolyzing acid amidase
Synonyms:
ASAH-like protein Acid ceramidase-like protein N-acylsphingosine amidohydrolase-like NAAA PLT
Type:
Enzyme
Mol. Mass.:
40073.12
Organism:
Homo sapiens (Human)
Description:
Q02083
Residue:
359
  
Inhibitor
Name:
BDBM319810
Synonyms:
US10174015, Compound 23
Type:
Small organic molecule
Emp. Form.:
C21H24N2O4
Mol. Mass.:
368.4263
SMILES:
CN(C)C[C@@H]1COC(=O)N1C(=O)c1ccc(OCCc2ccccc2)cc1
: