Target
Lysine-specific demethylase 5B
Ligand
BDBM314110
Substrate
Meas. Tech.
JMJD2C Assay
IC50
<100±n/a nM
Citation
 Chen, YKKanouni, TNie, ZStafford, JAVeal, JMWallace, MB Histone demethylase inhibitors US Patent  US10179769 Publication Date 1/15/2019 
Target
Name:
Lysine-specific demethylase 5B
Synonyms:
CT31 Histone demethylase JARID1B Jumonji/ARID domain-containing protein 1B KDM5B_HUMAN Lysine-specific demethylase 5B (KDM5Flag-5B-FL) PLU1 RBP2-H1 | Retinoblastoma-binding protein 2 homolog 1
Type:
Protein
Mol. Mass.:
175659.67
Organism:
Homo sapiens (Human)
Description:
Q9UGL1
Residue:
1544
  
Inhibitor
Name:
BDBM314110
Synonyms:
3-[(3,4-dichlorobenzyl)amino]pyridine-4-carboxylic acid US10807956, Example 14 US11639333, Example 14 US9725441, Example 14 | US9828343, Example 14
Type:
Small organic molecule
Emp. Form.:
C13H10Cl2N2O2
Mol. Mass.:
297.137
SMILES:
OC(=O)c1ccncc1NCc1ccc(Cl)c(Cl)c1
: