Target
Chromatin remodeling regulator CECR2 [424-538]
Ligand
BDBM321472
Substrate
Meas. Tech.
IC50 Measurements for Inhibitors Using TAF1-BD2 TR-FRET Binding Assay
IC50
900±n/a nM
Citation
 Albrecht, BKBellon, SFBurdick, DJCote, ACrawford, TDakin, LAHsiao-Wei Tsui, VHewitt, MCLeBlanc, YMagnuson, SRNasveschuk, CGRomero, FATang, YTaylor, AMWang, S Therapeutic compounds and uses thereof US Patent  US10183009 Publication Date 1/22/2019 
Target
Name:
Chromatin remodeling regulator CECR2 [424-538]
Synonyms:
CECR2 CECR2_HUMAN KIAA1740
Type:
Enzyme Catalytic Domain
Mol. Mass.:
13747.10
Organism:
Homo sapiens (Human)
Description:
Q9BXF3[424-538]
Residue:
115
  
Inhibitor
Name:
BDBM321472
Synonyms:
4-[5-(6-acetyl-2,6-diazaspiro[3.3]heptane-2-carbonyl)-2-methoxy-phenyl]-6-[(E)-but-2-enyl]-1H-pyrrolo[2,3-c]pyridin-7-one | US10183009, Example 77
Type:
Small organic molecule
Emp. Form.:
C26H28N4O4
Mol. Mass.:
460.5249
SMILES:
COc1ccc(cc1-c1cn(C\C=C\C)c(=O)c2[nH]ccc12)C(=O)N1CC2(CN(C2)C(C)=O)C1
: