Target
Fatty-acid amide hydrolase 1 [30-579]
Ligand
BDBM50153438
Substrate
Meas. Tech.
In Vitro Rat FAAH Radiometric Assay
IC50
2.60±n/a nM
Citation
 De Vivo, MScarpelli, RCavalli, AMigliore, MPiomelli, DHabrant, DFavia, A Multitarget FAAH and COX inhibitors and therapeutical uses thereof US Patent  US9630914 Publication Date 4/25/2017 
Target
Name:
Fatty-acid amide hydrolase 1 [30-579]
Synonyms:
Anandamide amidohydrolase 1 Faah Fatty Acid Amide Hydrolase Fatty-acid amide hydrolase (FAAH) Fatty-acid amide hydrolase 1 (FAAH) Oleamide hydrolase 1
Type:
Single-pass membrane protein; homodimer
Mol. Mass.:
60474.00
Organism:
Rattus norvegicus (rat)
Description:
P97612 (aa 30-579)
Residue:
550
  
Inhibitor
Name:
BDBM50153438
Synonyms:
CHEMBL3774873 | US9630914, Example 14
Type:
Small organic molecule
Emp. Form.:
C24H30FNO4
Mol. Mass.:
415.4977
SMILES:
CCCCCCCCNC(=O)Oc1cccc(c1)-c1ccc(cc1F)C(C)C(O)=O
: