Target
Protein M2-1
Ligand
BDBM324687
Substrate
Meas. Tech.
Viral Cytopathic Effect (CPE) Assay
EC50
7.00±n/a nM
Citation
 Wang, LGao, LHuang, MGuo, LLiang, CZhu, WFeng, SZheng, XZhang, WWu, GWang, BYun, H Aza-oxo-indoles for the treatment and prophylaxis of respiratory syncytial virus infection US Patent  US10189838 Publication Date 1/29/2019 
Target
Name:
Protein M2-1
Synonyms:
Envelope-associated 22 kDa protein M21_HRSVA | Matrix M2-1
Type:
Enzyme Catalytic Domain
Mol. Mass.:
22163.59
Organism:
Human respiratory syncytial virus A (strain A2)
Description:
P04545
Residue:
194
  
Inhibitor
Name:
BDBM324687
Synonyms:
1'-[(5-Chloro-1-{3-[(3-oxopiperazin- 1-yl)sulfonyl]propyl}-1H-indol-2- yl)methyl]spiro[cyclopropane-1,3'- pyrrolo[2,3-c]pyridin]-2'(1'H)-one | US10189838, Example 7-6
Type:
Small organic molecule
Emp. Form.:
C25H26ClN5O4S
Mol. Mass.:
528.023
SMILES:
Clc1ccc2n(CCCS(=O)(=O)N3CCNC(=O)C3)c(CN3C(=O)C4(CC4)c4ccncc34)cc2c1
: