Target
Dipeptidyl peptidase 2
Ligand
BDBM11668
Substrate
BDBM11156
Meas. Tech.
Dipeptidyl Peptidase Inhibition Assay
IC50
850±n/a nM
Citation
 Xu, JWei, LMathvink, RJEdmondson, SDEiermann, GJHe, HLeone, JFLeiting, BLyons, KAMarsilio, FPatel, RAPatel, SBPetrov, AScapin, GWu, JKThornberry, NAWeber, AE Discovery of potent, selective, and orally bioavailable oxadiazole-based dipeptidyl peptidase IV inhibitors. Bioorg Med Chem Lett 16:5373-7 (2006)  
Target
Name:
Dipeptidyl peptidase 2
Synonyms:
DAP II DPP2_HUMAN Dipeptidyl aminopeptidase II Dipeptidyl peptidase 2 (DPP2) Dipeptidyl peptidase II (DPP II) Dipeptidyl peptidase II and dipeptidyl peptidase IV (DPP2 and DPP4) carboxytripeptidase dipeptidyl(amino)peptidase II | dipeptidylarylamidase
Type:
Protein
Mol. Mass.:
54339.29
Organism:
Homo sapiens (Human)
Description:
Q9UHL4
Residue:
492
  
Inhibitor
Name:
BDBM11668
Synonyms:
(2S,3S)-3-[5-(2,4-dichlorophenyl)-1,3,4-oxadiazol-2-yl]-1-oxo-1-(pyrrolidin-1-yl)butan-2-aminium; 2,2,2-trifluoroacetate oxadiazole based amide
Type:
Small organic molecule
Emp. Form.:
C16H19Cl2N4O2
Mol. Mass.:
370.253
SMILES:
C[C@@H]([C@H]([NH3+])C(=O)N1CCCC1)c1nnc(o1)-c1ccc(Cl)cc1Cl
:
Substrate
Name:
BDBM11156
Synonyms:
1-(2-aminohexanoyl)-N-(4-methyl-2-oxo-2H-chromen-7-yl)pyrrolidine-2-carboxamide Nle-Pro-AMC
Type:
Emp. Form.:
Mol. Mass.:
SMILES:
: