Target
Nuclear receptor ROR-gamma
Ligand
BDBM329695
Substrate
Meas. Tech.
Biological Assay
IC50
886±n/a nM
Citation
 Barr, KJMaclean, JKZhang, HBeresis, RTAnthony, NJDaniels, MLapointe, BTSciammetta, N 3-aminocycloalkyl compounds as RORgammaT inhibitors and uses thereof US Patent  US9663522 Publication Date 5/30/2017 
Target
Name:
Nuclear receptor ROR-gamma
Synonyms:
NR1F3 Nuclear receptor ROR-gamma (RORC) RAR-related orphan receptor C (RORc) RORG RZRG Retinoid-related orphan receptor-gamma (RORc)
Type:
Enzyme Catalytic Domain
Mol. Mass.:
58218.40
Organism:
Homo sapiens (Human)
Description:
P51449
Residue:
518
  
Inhibitor
Name:
BDBM329695
Synonyms:
(3R,4S)-1-(1-(2-chloro-6-(trifluoromethyl)benzoyl)-1H-pyrazolo[4,3-b]pyridin-3-yl)-3-methylpiperidine-4-carboxylic acid | US9663522, 1B
Type:
Small organic molecule
Emp. Form.:
C21H18ClF3N4O3
Mol. Mass.:
466.841
SMILES:
C[C@H]1CN(CC[C@@H]1C(O)=O)c1nn(C(=O)c2c(Cl)cccc2C(F)(F)F)c2cccnc12
: