Target
Nuclear receptor ROR-gamma
Ligand
BDBM329716
Substrate
Meas. Tech.
Biological Assay
IC50
3.00±n/a nM
Citation
 Barr, KJMaclean, JKZhang, HBeresis, RTAnthony, NJDaniels, MLapointe, BTSciammetta, N 3-aminocycloalkyl compounds as RORgammaT inhibitors and uses thereof US Patent  US9663522 Publication Date 5/30/2017 
Target
Name:
Nuclear receptor ROR-gamma
Synonyms:
NR1F3 Nuclear receptor ROR-gamma (RORC) RAR-related orphan receptor C (RORc) RORG RZRG Retinoid-related orphan receptor-gamma (RORc)
Type:
Enzyme Catalytic Domain
Mol. Mass.:
58218.40
Organism:
Homo sapiens (Human)
Description:
P51449
Residue:
518
  
Inhibitor
Name:
BDBM329716
Synonyms:
1-(1-(2-chloro-6- cyclobutylbenzoyl)- 4-fluoro-1H- indazol-3- yl)piperidine-4- carboxylic acid | US9663522, 3B
Type:
Small organic molecule
Emp. Form.:
C24H23ClFN3O3
Mol. Mass.:
455.909
SMILES:
OC(=O)C1CCN(CC1)c1nn(C(=O)c2c(Cl)cccc2C2CCC2)c2cccc(F)c12
: