Target
Carbonic anhydrase 2
Ligand
BDBM11936
Substrate
BDBM11402
Meas. Tech.
In Vitro Binding for Human Carbonic Anhydrase II
pH
7.4±n/a
Temperature
310.15±n/a K
Kd
0.1±.01 nM
Citation
 Boriack-Sjodin, PAZeitlin, SChen, HHCrenshaw, LGross, SDantanarayana, ADelgado, PMay, JADean, TChristianson, DW Structural analysis of inhibitor binding to human carbonic anhydrase II. Protein Sci 7:2483-9 (1998)  
Target
Name:
Carbonic anhydrase 2
Synonyms:
CA-II CAC Carbonate dehydratase II Carbonic anhydrase 2 (CA-II) Carbonic anhydrase C Carbonic anhydrase II (CA-II) Carbonic anhydrase II (hCA II) | Carbonic anhydrase isoenzyme II (hCA II)
Type:
Enzyme
Mol. Mass.:
29250.71
Organism:
Homo sapiens (Human)
Description:
P00918
Residue:
260
  
Inhibitor
Name:
BDBM11936
Synonyms:
(4R)-2-(3-methoxyphenyl)-4-(methylamino)-1,1-dioxo-2H,3H,4H-1,7,2-thieno[3,2-e][1,2]thiazine-6-sulfonamide AL7089
Type:
Small organic molecule
Emp. Form.:
C14H17N3O5S3
Mol. Mass.:
403.497
SMILES:
CN[C@H]1CN(c2cccc(OC)c2)S(=O)(=O)c2sc(cc12)S(N)(=O)=O
:
Substrate
Name:
BDBM11402
Synonyms:
5-(dimethylamino)naphthalene-1-sulfonamide | dansylamide
Type:
Small organic molecule
Emp. Form.:
C12H14N2O2S
Mol. Mass.:
250.317
SMILES:
CN(C)c1cccc2c(cccc12)S(N)(=O)=O
: