Target
Falcipain-2
Ligand
BDBM12037
Substrate
BDBM12033
Meas. Tech.
Falcipain Enzyme Inhibition Assay
pH
5.5±n/a
Temperature
295.15±n/a K
IC50
1800±n/a nM
Citation
 Dominguez, JNLeon, CRodrigues, JGamboa de Dominguez, NGut, JRosenthal, PJ Synthesis and evaluation of new antimalarial phenylurenyl chalcone derivatives. J Med Chem 48:3654-8 (2005)  
Target
Name:
Falcipain-2
Synonyms:
Type:
Enzyme
Mol. Mass.:
55912.57
Organism:
Plasmodium falciparum
Description:
Residue:
484
  
Inhibitor
Name:
BDBM12037
Synonyms:
3-(4-chlorophenyl)-1-{4-[(2E)-3-(3,4,5-trimethoxyphenyl)prop-2-enoyl]phenyl}urea | Phenylurenyl Chalcone deriv. 27
Type:
Small organic molecule
Emp. Form.:
C25H23ClN2O5
Mol. Mass.:
466.914
SMILES:
COc1cc(\C=C\C(=O)c2ccc(NC(=O)Nc3ccc(Cl)cc3)cc2)cc(OC)c1OC
:
Substrate
Name:
BDBM12033
Synonyms:
CBZ-Leu-Arg-AMC benzyl N-[(1S)-1-{[(1S)-4-carbamimidamido-1-[(4-methyl-2-oxo-2H-chromen-7-yl)carbamoyl]butyl]carbamoyl}-3-methylbutyl]carbamate | benzyloxycarbonyl-Leu-Arg-7-amino-4-methyl-coumarin
Type:
Small organic molecule
Emp. Form.:
C30H38N6O6
Mol. Mass.:
578.6593
SMILES:
[#6]-[#6](-[#6])-[#6]-[#6@H](-[#7]-[#6](=O)-[#8]-[#6]-c1ccccc1)-[#6](=O)-[#7]-[#6@@H](-[#6]-[#6]-[#6]\[#7]=[#6](\[#7])-[#7])-[#6](=O)-[#7]-c1ccc2c(-[#6])cc(=O)oc2c1
: