Target
Cyclin-H/Cyclin-dependent kinase 7
Ligand
BDBM12130
Substrate
FAM-CDK7 derived peptide
Meas. Tech.
Homogeneous Time-resolved Fluorescence (HTRF) Assay
IC50
7000±n/a nM
Citation
 Fraley, MESteen, JTBrnardic, EJArrington, KLSpencer, KLHanney, BAKim, YHartman, GDStirdivant, SMDrakas, BARickert, KWalsh, ESHamilton, KBuser, CAHardwick, JTao, WBeck, SCMao, XLobell, RBSepp-Lorenzino, LYan, YIkuta, MMunshi, SKKuo, LCKreatsoulas, C 3-(Indol-2-yl)indazoles as Chek1 kinase inhibitors: Optimization of potency and selectivity via substitution at C6. Bioorg Med Chem Lett 16:6049-53 (2006)  
Target
Name:
Cyclin-H/Cyclin-dependent kinase 7
Synonyms:
CDK-activating kinase assembly factor MAT1/Cyclin H/Cyclin-dependent kinase 7 CDK7/H Cyclin-Dependent Kinase 7 (CDK7) Cyclin-dependent kinase 7/cyclin H
Type:
Protein Complex
Mol. Mass.:
Description:
Components:
This complex has 2 components.
Component 1
Name:
Cyclin-H
Synonyms:
CCNH Cyclin H p34 | p37
Type:
Enzyme Subunit
Mol. Mass.:
37646.05
Organism:
Homo sapiens (Human)
Description:
Residue:
323
  
Component 2
Name:
Cyclin-dependent kinase 7
Synonyms:
39 kDa protein kinase CAK1 CDK-activating kinase 1 (CAK) CDK7_HUMAN Cell division protein kinase 7 Cyclin-dependent kinase 7 (CDK7/cyclin H) P39 Mo15 TFIIH basal transcription factor complex kinase subunit
Type:
Enzyme Subunit
Mol. Mass.:
39047.01
Organism:
Homo sapiens (Human)
Description:
Residue:
346
  
Inhibitor
Name:
BDBM12130
Synonyms:
3-(Indol-2-yl)indazole 20 | 6-phenyl-3-[5-(piperidin-1-ylmethyl)-1H-indol-2-yl]-1H-indazole
Type:
Small organic molecule
Emp. Form.:
C27H26N4
Mol. Mass.:
406.5221
SMILES:
C(N1CCCCC1)c1ccc2[nH]c(cc2c1)-c1n[nH]c2cc(ccc12)-c1ccccc1
:
Substrate
Name:
FAM-CDK7 derived peptide
Synonyms:
Type:
Peptide
Mol. Mass.:
2205.10
Organism:
Description:
Residue:
19
FAMFLAKSFGSPNRAYKKH