Target
Genome polyprotein
Ligand
BDBM12278
Substrate
NS3-NS4A Chromogenic Peptide Substrate
Meas. Tech.
Continuous Spectrophotometric Assay
pH
6.5±n/a
Temperature
303.15±n/a K
Ki
100±n/a nM
Citation
 Venkatraman, SBogen, SLArasappan, ABennett, FChen, KJao, ELiu, YTLovey, RHendrata, SHuang, YPan, WParekh, TPinto, PPopov, VPike, RRuan, SSanthanam, BVibulbhan, BWu, WYang, WKong, JLiang, XWong, JLiu, RButkiewicz, NChase, RHart, AAgrawal, SIngravallo, PPichardo, JKong, RBaroudy, BMalcolm, BGuo, ZProngay, AMadison, VBroske, LCui, XCheng, KCHsieh, YBrisson, JMPrelusky, DKorfmacher, WWhite, RBogdanowich-Knipp, SPavlovsky, ABradley, PSaksena, AKGanguly, APiwinski, JGirijavallabhan, VNjoroge, FG Discovery of (1R,5S)-N-[3-amino-1-(cyclobutylmethyl)-2,3-dioxopropyl]-3-[2(S)-[[[(1,1-dimethylethyl)amino]carbonyl]amino]-3,3-dimethyl-1-oxobutyl]-6,6-dimethyl-3-azabicyclo[3.1.0]hexan-2(S)-carboxamide (SCH 503034), a selective, potent, orally bioavailable hepatitis C virus NS3 protease inhibitor J Med Chem 49:6074-86 (2006)  
Target
Name:
Genome polyprotein
Synonyms:
Dipeptidyl peptidase 4 (DPP4) NS3 NS5B NS3-4A Protease NS3/4A protease POLG_HCV77 | RNA polymerase (NS5B)
Type:
Protease Domain
Mol. Mass.:
327221.49
Organism:
Hepatitis C virus (HCV genotype 1a, isolate H)
Description:
P27958
Residue:
3011
  
Inhibitor
Name:
BDBM12278
Synonyms:
1,1-Dimethylethyl-[2-[(1R,5S)-2(S)-[[[1-(2-amino-1,2-dioxoethyl)butyl]amino]carbonyl]-6,6-dimethyl-3-azabicyclo[3.1.0]hexan-3-yl]-1(S)-cyclohexyl-2-oxoethyl]carbamates tert-butyl N-[(1S)-2-[(1R,2S,5S)-2-[(1-carbamoyl-1-oxopentan-2-yl)carbamoyl]-6,6-dimethyl-3-azabicyclo[3.1.0]hexan-3-yl]-1-cyclohexyl-2-oxoethyl]carbamate
Type:
Small organic molecule
Emp. Form.:
C27H44N4O6
Mol. Mass.:
520.6615
SMILES:
CCCC(NC(=O)[C@@H]1[C@@H]2[C@H](CN1C(=O)[C@@H](NC(=O)OC(C)(C)C)C1CCCCC1)C2(C)C)C(=O)C(N)=O
:
Substrate
Name:
NS3-NS4A Chromogenic Peptide Substrate
Synonyms:
Type:
Peptide
Mol. Mass.:
1366.94
Organism:
Description:
The 4-phenylazophenol (PAP) chromophore was incorporated to improve assay sensitivity.
Residue:
13
ACDTEDVVPNVAH