Target
Nuclear receptor ROR-gamma
Ligand
BDBM332507
Substrate
Meas. Tech.
Biological Assays
IC50
53.0±n/a nM
Citation
 Barr, KJBienstock, CEMaclean, JKZhang, HBeresis, RTZhang, DAnthony, NJLapointe, BTTian, Y 4-heteroaryl substituted benzoic acid compounds as RORgammaT inhibitors and uses thereof US Patent  US10196354 Publication Date 2/5/2019 
Target
Name:
Nuclear receptor ROR-gamma
Synonyms:
NR1F3 Nuclear receptor ROR-gamma (RORC) RAR-related orphan receptor C (RORc) RORG RZRG Retinoid-related orphan receptor-gamma (RORc)
Type:
Enzyme Catalytic Domain
Mol. Mass.:
58218.40
Organism:
Homo sapiens (Human)
Description:
P51449
Residue:
518
  
Inhibitor
Name:
BDBM332507
Synonyms:
4-(1-(2-chloro-6-(trifluoromethyl)benzoyl)-6-(2,5-dioxoimidazolidin-4-yl)-1H-indazol-3-yl)-3-fluorobenzoic acid (27A) US9745265, 27A
Type:
Small organic molecule
Emp. Form.:
C25H13ClF4N4O5
Mol. Mass.:
560.841
SMILES:
OC(=O)c1ccc(-c2nn(C(=O)c3c(Cl)cccc3C(F)(F)F)c3cc(ccc23)C2NC(=O)NC2=O)c(F)c1
: