Target
Genome polyprotein
Ligand
BDBM12474
Substrate
NS3-NS4A Chromogenic Peptide Substrate
Meas. Tech.
Continuous Spectrophotometric Assay
pH
6.5±n/a
Temperature
303.15±n/a K
Ki
44±n/a nM
Citation
 Chen, KXNjoroge, FGArasappan, AVenkatraman, SVibulbhan, BYang, WParekh, TNPichardo, JProngay, ACheng, KCButkiewicz, NYao, NMadison, VGirijavallabhan, V Novel potent hepatitis C virus NS3 serine protease inhibitors derived from proline-based macrocycles. J Med Chem 49:995-1005 (2006)  
Target
Name:
Genome polyprotein
Synonyms:
Dipeptidyl peptidase 4 (DPP4) NS3 NS5B NS3-4A Protease NS3/4A protease POLG_HCV77 | RNA polymerase (NS5B)
Type:
Protease Domain
Mol. Mass.:
327221.49
Organism:
Hepatitis C virus (HCV genotype 1a, isolate H)
Description:
P27958
Residue:
3011
  
Inhibitor
Name:
BDBM12474
Synonyms:
Proline-Based Macrocycle 22 tert-butyl (2S)-2-[2-(3-{[(7R,9S,12S)-12-cyclohexyl-11,14-dioxo-2,6-dioxa-10,13-diazatricyclo[14.3.1.1^{7,10}]henicosa-1(20),16,18-trien-9-yl]formamido}-2-oxohexanamido)acetamido]-2-phenylacetate
Type:
Small organic molecule
Emp. Form.:
C44H59N5O10
Mol. Mass.:
817.9668
SMILES:
CCCC(NC(=O)[C@@H]1C[C@@H]2CN1C(=O)[C@@H](NC(=O)Cc1cccc(OCCCO2)c1)C1CCCCC1)C(=O)C(=O)NCC(=O)N[C@H](C(=O)OC(C)(C)C)c1ccccc1
:
Substrate
Name:
NS3-NS4A Chromogenic Peptide Substrate
Synonyms:
Type:
Peptide
Mol. Mass.:
1366.94
Organism:
Description:
The 4-phenylazophenol (PAP) chromophore was incorporated to improve assay sensitivity.
Residue:
13
ACDTEDVVPNVAH