Target
Receptor tyrosine-protein kinase erbB-2
Ligand
BDBM332540
Substrate
Meas. Tech.
HTRF kinEASE TK
IC50
132±n/a nM
Citation
 Hong, JXu, XLe, XZhang, Z Quinazoline derivative, preparation method therefor, and pharmaceutical composition and application thereof US Patent  US10196365 Publication Date 2/5/2019 
Target
Name:
Receptor tyrosine-protein kinase erbB-2
Synonyms:
2.7.10.1 CD_antigen=CD340 ERBB2_HUMAN FASN/HER2 HER2 MLN19 NEU Proto-oncogene Neu Tyrosine kinase-type cell surface receptor HER2 | p185erbB2
Type:
Mol. Mass.:
137894.47
Organism:
Homo sapiens (Human)
Description:
P04626
Residue:
1255
  
Inhibitor
Name:
BDBM332540
Synonyms:
(E)-N-(4-(3-chloro-4-fluorophenylamino)-7-(2-propoxyethoxy)quinazolin-6-yl)-4-(dimethylamino)but-2-enamide | US10196365, Compound 5
Type:
Small organic molecule
Emp. Form.:
C25H29ClFN5O3
Mol. Mass.:
501.981
SMILES:
CCCOCCOc1cc2ncnc(Nc3ccc(F)c(Cl)c3)c2cc1NC(=O)\C=C\CN(C)C
: