Target
Phosphatidylinositol 4,5-bisphosphate 3-kinase catalytic subunit delta isoform
Ligand
BDBM334108
Substrate
Meas. Tech.
Biochemical Assay
IC50
<1.000±n/a nM
Citation
 Achab, AAAltman, MDDeng, YGuzi, TKattar, SKatz, JDMethot, JLZhou, HMcGowan, MChristopher, MPGarcia, YAnthony, NJFradera Llinas, FXFong, KCLeng, XMu, CZhang, SZhang, R Purine inhibitors of human phosphatidylinositol 3-kinase delta US Patent  US9730940 Publication Date 8/15/2017 
Target
Name:
Phosphatidylinositol 4,5-bisphosphate 3-kinase catalytic subunit delta isoform
Synonyms:
PI3-kinase p110 subunit delta PI3-kinase subunit p110-delta PIK3CD Phosphatidylinositol 4,5-biphosphate 3-kinase catalytic subunit delta (PIK3CD) Phosphatidylinositol 4,5-bisphosphate 3-kinase 110 kDa catalytic subunit delta (PI3K delta) Phosphatidylinositol 4,5-bisphosphate 3-kinase catalytic subunit delta (PI3Kdelta) Phosphatidylinositol 4,5-bisphosphate 3-kinase catalytic subunit delta isoform (PI3K delta) Phosphatidylinositol 4,5-bisphosphate 3-kinase catalytic subunit delta isoform (PI3K-delta) Phosphatidylinositol 4,5-bisphosphate 3-kinase catalytic subunit delta isoform (PI3Kdelta)
Type:
Enzyme Subunit
Mol. Mass.:
119489.41
Organism:
Homo sapiens (Human)
Description:
O00329
Residue:
1044
  
Inhibitor
Name:
BDBM334108
Synonyms:
6-{[(3S)-1- (cyclopropylcarbonyl)pyrrolidin- 3-yl]oxy}-9-ethyl-8-(6- methoxy-5-methylpyridin-3-yl)- 9H-purine | US9730940, Compound 3-49
Type:
Small organic molecule
Emp. Form.:
C22H26N6O3
Mol. Mass.:
422.4802
SMILES:
CCn1c(nc2c(O[C@H]3CCN(C3)C(=O)C3CC3)ncnc12)-c1cnc(OC)c(C)c1
: