Target
ATP-dependent RNA helicase RhlE
Ligand
BDBM13316
Substrate
biotinylated lamin B peptide substrate
Meas. Tech.
PFT IC50 Determination
pH
7.5±n/a
Temperature
310.15±n/a K
IC50
240±n/a nM
Citation
 Glenn, MPChang, SYHorney, CRivas, KYokoyama, KPusateri, EEFletcher, SCummings, CGBuckner, FSPendyala, PRChakrabarti, DSebti, SMGelb, MVan Voorhis, WCHamilton, AD Structurally simple, potent, Plasmodium selective farnesyltransferase inhibitors that arrest the growth of malaria parasites. J Med Chem 49:5710-27 (2006)  
Target
Name:
ATP-dependent RNA helicase RhlE
Synonyms:
Protein Farnesyltransferase (PFT) | Protein prenyltransferase, alpha subunit
Type:
Enzyme
Mol. Mass.:
54781.31
Organism:
Plasmodium falciparum (malaria parasite P. falciparum)
Description:
Q5E175
Residue:
500
  
Inhibitor
Name:
BDBM13316
Synonyms:
1-Methyl-1H-imidazole-4-sulfonic Acid Biphenyl-4-ylmethyl-{2-[(4-cyanophenyl)-(3-methyl-3H-imidazol-4-ylmethyl)amino]-ethyl}amide Sulfonamide 12ag
Type:
Small organic molecule
Emp. Form.:
C31H31N7O2S
Mol. Mass.:
565.689
SMILES:
Cn1cnc(c1)S(=O)(=O)N(CCN(Cc1cncn1C)c1ccc(cc1)C#N)Cc1ccc(cc1)-c1ccccc1
:
Substrate
Name:
biotinylated lamin B peptide substrate
Synonyms:
Type:
Peptide
Mol. Mass.:
1715.01
Organism:
Description:
A human lamin-B carboxy-terminus sequence peptide (biotin-YRASNRSCAIM) is 3H-farnesylated at the cysteine residue when processed by farnesyltransferase.
Residue:
15
ITINYRASNRSCAIM