Target
Lysine-specific demethylase 4C
Ligand
BDBM320446
Substrate
Meas. Tech.
Enzymatic Assay
IC50
<100±n/a nM
Citation
 Chen, YKWallace, MB Histone demethylase inhibitors US Patent  US9738637 Publication Date 8/22/2017 
Target
Name:
Lysine-specific demethylase 4C
Synonyms:
GASC-1 protein Gene amplified in squamous cell carcinoma 1 protein JMJD2C Jumonji domain-containing protein 2C KDM4C_HUMAN | KIAA0780
Type:
Protein
Mol. Mass.:
119979.01
Organism:
Homo sapiens (Human)
Description:
Q9H3R0
Residue:
1056
  
Inhibitor
Name:
BDBM320446
Synonyms:
2-(3,4-difluorobenzyl)-1H- pyrrolo[3,2-b]pyridine-7- carboxylic acid US9738637, Example 126
Type:
Small organic molecule
Emp. Form.:
C15H10F2N2O2
Mol. Mass.:
288.2489
SMILES:
OC(=O)c1ccnc2cc(Cc3ccc(F)c(F)c3)[nH]c12
: