Target
Carbonic anhydrase 2
Ligand
BDBM13425
Substrate
BDBM11326
Meas. Tech.
Carbonic Anhydrase Inhibition Assay
pH
7.8±n/a
Temperature
293.15±n/a K
IC50
526±n/a nM
Citation
 Ho, YTPurohit, AVicker, NNewman, SPRobinson, JJLeese, MPGaneshapillai, DWoo, LWPotter, BVReed, MJ Inhibition of carbonic anhydrase II by steroidal and non-steroidal sulphamates. Biochem Biophys Res Commun 305:909-14 (2003)  
Target
Name:
Carbonic anhydrase 2
Synonyms:
CA-II CAC Carbonate dehydratase II Carbonic anhydrase 2 (CA-II) Carbonic anhydrase C Carbonic anhydrase II (CA-II) Carbonic anhydrase II (hCA II) | Carbonic anhydrase isoenzyme II (hCA II)
Type:
Enzyme
Mol. Mass.:
29250.71
Organism:
Homo sapiens (Human)
Description:
P00918
Residue:
260
  
Inhibitor
Name:
BDBM13425
Synonyms:
(15S)-5-hydroxy-4-methoxy-15-methyltetracyclo[8.7.0.0^{2,7}.0^{11,15}]heptadeca-2(7),3,5-trien-14-yl sulfamate | oestrogen deriv. 10
Type:
Small organic molecule
Emp. Form.:
C19H27NO5S
Mol. Mass.:
381.486
SMILES:
COc1cc2C3CC[C@]4(C)C(CCC4C3CCc2cc1O)OS(N)(=O)=O
:
Substrate
Name:
BDBM11326
Synonyms:
4-nitrophenyl acetate | p-Nitrophenyl Acetate
Type:
Small organic molecule
Emp. Form.:
C8H7NO4
Mol. Mass.:
181.1455
SMILES:
CC(=O)Oc1ccc(cc1)[N+]([O-])=O
: