Target
Steryl-sulfatase
Ligand
BDBM13427
Substrate
BDBM10022
Meas. Tech.
Carbonic Anhydrase Inhibition Assay
IC50
10000±n/a nM
Citation
 Ho, YTPurohit, AVicker, NNewman, SPRobinson, JJLeese, MPGaneshapillai, DWoo, LWPotter, BVReed, MJ Inhibition of carbonic anhydrase II by steroidal and non-steroidal sulphamates. Biochem Biophys Res Commun 305:909-14 (2003)  
Target
Name:
Steryl-sulfatase
Synonyms:
ARSC1 Arylsulfatase C STS_HUMAN Steryl-sulfate sulfohydrolase
Type:
Enzyme
Mol. Mass.:
65503.66
Organism:
Homo sapiens (Human)
Description:
P08842
Residue:
583
  
Inhibitor
Name:
BDBM13427
Synonyms:
(15S)-4-ethyl-15-methyl-14-oxotetracyclo[8.7.0.0^{2,7}.0^{11,15}]heptadeca-2(7),3,5-trien-5-yl sulfamate | oestrogen deriv. 12
Type:
Small organic molecule
Emp. Form.:
C20H27NO4S
Mol. Mass.:
377.498
SMILES:
CCc1cc2C3CC[C@@]4(C)C(CCC4=O)C3CCc2cc1OS(N)(=O)=O
:
Substrate
Name:
BDBM10022
Synonyms:
13-methyl-17-oxo-3-sulfooxy-7,8,9,11,12,14,15,16-octahydro-6H-cyclopenta[a]phenanthrene [3H]Estrone 3-sulfate [6,7-3H] E1S | {15-methyl-14-oxotetracyclo[8.7.0.0^{2,7}.0^{11,15}]heptadeca-2(7),3,5-trien-5-yl}oxidanesulfonic acid
Type:
Small organic molecule
Emp. Form.:
C18H22O5S
Mol. Mass.:
350.429
SMILES:
CC12CCC3C(CCc4cc(OS(O)(=O)=O)ccc34)C1CCC2=O
: