Target
Tyrosine-protein phosphatase non-receptor type 1 [1-298]
Ligand
BDBM13438
Substrate
BDBM13432
Meas. Tech.
Phosphatase Inhibition Assay
pH
7±n/a
Temperature
295.15±n/a K
IC50
153500±n/a nM
Citation
 Klopfenstein, SREvdokimov, AGColson, AOFairweather, NTNeuman, JJMaier, MBGray, JLGerwe, GSStake, GEHoward, BWFarmer, JAPokross, MEDowns, TRKasibhatla, BPeters, KG 1,2,3,4-Tetrahydroisoquinolinyl sulfamic acids as phosphatase PTP1B inhibitors. Bioorg Med Chem Lett 16:1574-8 (2006)  
Target
Name:
Tyrosine-protein phosphatase non-receptor type 1 [1-298]
Synonyms:
PTN1_HUMAN PTP1B PTPase 1B Tyrosine-protein phosphatase, non-receptor type 1
Type:
Enzyme
Mol. Mass.:
34670.65
Organism:
Homo sapiens (Human)
Description:
The catalytic domain of PTP 1B (residues 1-298) was expressed and purified from E. coli.
Residue:
298
  
Inhibitor
Name:
BDBM13438
Synonyms:
Tetrahydroisoquinoline (TIQ) deriv. 8e | ammonium N-[(3S)-2-(3-carboxypropanoyl)-3-(methylcarbamoyl)-1,2,3,4-tetrahydroisoquinolin-7-yl]sulfamate
Type:
Small organic molecule
Emp. Form.:
C15H18N3O7S
Mol. Mass.:
384.385
SMILES:
CNC(=O)[C@@H]1Cc2ccc(NS([O-])(=O)=O)cc2CN1C(=O)CCC(O)=O
:
Substrate
Name:
BDBM13432
Synonyms:
6,8-difluoro-4-methylumbelliferyl phosphate [(6,8-difluoro-4-methyl-2-oxo-2H-chromen-7-yl)oxy]phosphonic acid
Type:
Small organic molecule
Emp. Form.:
C10H7F2O6P
Mol. Mass.:
292.1295
SMILES:
Cc1cc(=O)oc2c(F)c(OP(O)(O)=O)c(F)cc12
: