Target
Sodium channel protein type 9 subunit alpha
Ligand
BDBM336811
Substrate
Meas. Tech.
Electrophysiology Assay
Ki
175±39 nM
Citation
 Ni, CPark, JHShao, BZhou, X Pyrimidines and use thereof US Patent  US9745287 Publication Date 8/29/2017 
Target
Name:
Sodium channel protein type 9 subunit alpha
Synonyms:
NENA Peripheral sodium channel 1 SCN9A_HUMAN Voltage-gated sodium channel subunit Nav1.7 hNE-Na
Type:
Protein
Mol. Mass.:
226375.97
Organism:
Homo sapiens (Human)
Description:
Q15858
Residue:
1988
  
Inhibitor
Name:
BDBM336811
Synonyms:
6-((((S)-1-amino-1-oxopropan- 2-yl)amino)methyl)-2-(4-(4- trifluoromethyl)phenoxy)cyclohex- 1-en-1-yl)pyrimidine- 4-carboxamide | US9745287, Compound 57
Type:
Small organic molecule
Emp. Form.:
C22H24F3N5O3
Mol. Mass.:
463.4529
SMILES:
C[C@H](NCc1cc(nc(n1)C1=CCC(CC1)Oc1ccc(cc1)C(F)(F)F)C(N)=O)C(N)=O
: