Target
Cytochrome P450 11B2, mitochondrial
Ligand
BDBM336826
Substrate
Meas. Tech.
Inhibition Assay
IC50
17.0±n/a nM
Citation
 Hornberger, KRMeyers, KMNemoto, PASurprenant, SYu, H Aldosterone synthase inhibitors US Patent  US9745289 Publication Date 8/29/2017 
Target
Name:
Cytochrome P450 11B2, mitochondrial
Synonyms:
Aldosterone Synthase (CYP11B2) Aldosterone-synthesizing enzyme CYP11B2 Cytochrome P450 11B2 Cytochrome P450 11B2, mitochondrial P-450C18 | Steroid 18-hydroxylase
Type:
Protein
Mol. Mass.:
57582.15
Organism:
Homo sapiens (Human)
Description:
P19099
Residue:
503
  
Inhibitor
Name:
BDBM336826
Synonyms:
US9745289, Compound 2A | US9745289, Compound 2B
Type:
Small organic molecule
Emp. Form.:
C18H15N3O3
Mol. Mass.:
321.33
SMILES:
NC(=O)c1cccc2OC(COc12)c1cncc(c1)C1(CC1)C#N
: