Target
Cytochrome P450 11B2, mitochondrial
Ligand
BDBM336935
Substrate
Meas. Tech.
Inhibition Assay
IC50
26.0±n/a nM
Citation
 Hornberger, KRMeyers, KMNemoto, PASurprenant, SYu, H Aldosterone synthase inhibitors US Patent  US9745289 Publication Date 8/29/2017 
Target
Name:
Cytochrome P450 11B2, mitochondrial
Synonyms:
Aldosterone Synthase (CYP11B2) Aldosterone-synthesizing enzyme CYP11B2 Cytochrome P450 11B2 Cytochrome P450 11B2, mitochondrial P-450C18 | Steroid 18-hydroxylase
Type:
Protein
Mol. Mass.:
57582.15
Organism:
Homo sapiens (Human)
Description:
P19099
Residue:
503
  
Inhibitor
Name:
BDBM336935
Synonyms:
US9745289, Compound 55A | US9745289, Compound 55B
Type:
Small organic molecule
Emp. Form.:
C20H19N3O4
Mol. Mass.:
365.3826
SMILES:
O[C@@H]1CCN(C1)C(=O)Cc1cncc(c1)C1COc2c(O1)cccc2C#N
: