Target
Cytochrome P450 11B2, mitochondrial
Ligand
BDBM336951
Substrate
Meas. Tech.
Inhibition Assay
IC50
320±n/a nM
Citation
 Hornberger, KRMeyers, KMNemoto, PASurprenant, SYu, H Aldosterone synthase inhibitors US Patent  US9745289 Publication Date 8/29/2017 
Target
Name:
Cytochrome P450 11B2, mitochondrial
Synonyms:
Aldosterone Synthase (CYP11B2) Aldosterone-synthesizing enzyme CYP11B2 Cytochrome P450 11B2 Cytochrome P450 11B2, mitochondrial P-450C18 | Steroid 18-hydroxylase
Type:
Protein
Mol. Mass.:
57582.15
Organism:
Homo sapiens (Human)
Description:
P19099
Residue:
503
  
Inhibitor
Name:
BDBM336951
Synonyms:
US9745289, Compound 62AA US9745289, Compound 62BA | US9745289, Compound 62BB
Type:
Small organic molecule
Emp. Form.:
C16H15N3O3S
Mol. Mass.:
329.374
SMILES:
CS(=N)(=O)Cc1cncc(c1)C1COc2c(O1)cccc2C#N
: