Target
Metabotropic glutamate receptor 5
Ligand
BDBM292153
Substrate
Meas. Tech.
Calcium Influx Assay Based on Fluorescence
EC50
300±n/a nM
Citation
 Park, CEJang, YKShin, YJKim, JYHam, SMKim, YGMin, HKCha, SBJung, HJLee, JYHan, SNChung, JYChoi, EJJoung, CMPark, JSLee, JWCho, NRRyu, EJMaeng, CY Imidazopyrimidine and imidazotriazine derivative, and pharmaceutical composition comprising the same US Patent  US9745310 Publication Date 8/29/2017 
Target
Name:
Metabotropic glutamate receptor 5
Synonyms:
GPRC1E GRM5_HUMAN metabotropic glutamate 5 | metabotropic glutamate 5a
Type:
Enzyme
Mol. Mass.:
132484.72
Organism:
Homo sapiens (Human)
Description:
Residue:
1212
  
Inhibitor
Name:
BDBM292153
Synonyms:
US10100057, Example 59 US11046702, Example 59 | US9745310, Example 59
Type:
Small organic molecule
Emp. Form.:
C19H14FN3O
Mol. Mass.:
319.3324
SMILES:
Fc1ccc(cc1)-c1cnc2nc(COc3ccccc3)cn2c1
: