Target
Metabotropic glutamate receptor 5
Ligand
BDBM292318
Substrate
Meas. Tech.
Calcium Influx Assay Based on Fluorescence
EC50
750±n/a nM
Citation
 Park, CEJang, YKShin, YJKim, JYHam, SMKim, YGMin, HKCha, SBJung, HJLee, JYHan, SNChung, JYChoi, EJJoung, CMPark, JSLee, JWCho, NRRyu, EJMaeng, CY Imidazopyrimidine and imidazotriazine derivative, and pharmaceutical composition comprising the same US Patent  US9745310 Publication Date 8/29/2017 
Target
Name:
Metabotropic glutamate receptor 5
Synonyms:
GPRC1E GRM5_HUMAN metabotropic glutamate 5 | metabotropic glutamate 5a
Type:
Enzyme
Mol. Mass.:
132484.72
Organism:
Homo sapiens (Human)
Description:
Residue:
1212
  
Inhibitor
Name:
BDBM292318
Synonyms:
US10100057, Example 173 US9745310, Example 173
Type:
Small organic molecule
Emp. Form.:
C19H11F5N4O
Mol. Mass.:
406.3089
SMILES:
Fc1ccc(-c2cnc3nc(COc4cncc(F)c4)cn3c2)c(c1)C(F)(F)F
: