Target
Dipeptidyl peptidase 8
Ligand
BDBM11645
Substrate
BDBM11057
Meas. Tech.
DPP Inhibition Assay
pH
7.5±n/a
Temperature
295.15±n/a K
Ki
>30000±n/a nM
Citation
 Kurukulasuriya, RRohde, JJSzczepankiewicz, BGBasha, FLai, CJae, HSWinn, MStewart, KDLongenecker, KLLubben, TWBallaron, SJSham, HLvon Geldern, TW Xanthine mimetics as potent dipeptidyl peptidase IV inhibitors. Bioorg Med Chem Lett 16:6226-30 (2006)  
Target
Name:
Dipeptidyl peptidase 8
Synonyms:
DPP8 DPRP-1 Dipeptidyl peptidase 8 (DPP-8) Dipeptidyl peptidase 8/9 Dipeptidyl peptidase VIII Prolyl dipeptidase DPP8
Type:
Enzyme
Mol. Mass.:
103342.62
Organism:
Homo sapiens (Human)
Description:
Q6V1X1
Residue:
898
  
Inhibitor
Name:
BDBM11645
Synonyms:
2-{[8-(3-aminopiperidin-1-yl)-1,3-dimethyl-2,6-dioxo-2,3,6,7-tetrahydro-1H-purin-7-yl]methyl}benzonitrile Xanthine mimetic compound 6
Type:
Small organic molecule
Emp. Form.:
C20H23N7O2
Mol. Mass.:
393.4423
SMILES:
Cn1c2nc(N3CCCC(N)C3)n(Cc3ccccc3C#N)c2c(=O)n(C)c1=O
:
Substrate
Name:
BDBM11057
Synonyms:
1-(2-aminoacetyl)-N-(4-methyl-2-oxo-2H-chromen-7-yl)pyrrolidine-2-carboxamide hydrobromide Gly-Pro-7-amidomethylcoumarin | Gly-Pro-AMC
Type:
Small organic molecule
Emp. Form.:
C17H19N3O4
Mol. Mass.:
329.3505
SMILES:
Cc1cc(=O)oc2cc(NC(=O)C3CCCN3C(=O)CN)ccc12
: