Target
Lysine-specific demethylase 4C
Ligand
BDBM340058
Substrate
Meas. Tech.
In Vitro Enzyme Inhibition Assay
IC50
5500±n/a nM
Citation
 Chen, YKWallace, MB Histone demethylase inhibitors US Patent  US9758517 Publication Date 9/12/2017 
Target
Name:
Lysine-specific demethylase 4C
Synonyms:
GASC-1 protein Gene amplified in squamous cell carcinoma 1 protein JMJD2C Jumonji domain-containing protein 2C KDM4C_HUMAN | KIAA0780
Type:
Protein
Mol. Mass.:
119979.01
Organism:
Homo sapiens (Human)
Description:
Q9H3R0
Residue:
1056
  
Inhibitor
Name:
BDBM340058
Synonyms:
2-[6-Chloro-1-(cyclopropylmethyl)-1H-indazol-3-yl]-1H-pyrrolo[3,2-b]pyridine-7-carboxylic acid US9758517, Example 18
Type:
Small organic molecule
Emp. Form.:
C19H15ClN4O2
Mol. Mass.:
366.801
SMILES:
OC(=O)c1ccnc2cc([nH]c12)-c1nn(CC2CC2)c2cc(Cl)ccc12
: