Target
Tyrosine-protein kinase Lck
Ligand
BDBM340085
Substrate
Meas. Tech.
Lck Enzyme Activity
EC50
>1000±n/a nM
Citation
 Barf, TAJans, CGde Man, APOubrie, AARaaijmakers, HCRewinkel, JBSterrenburg, JGWijkmans, JC 4-imidazopyridazin-1-yl-benzamides as Btk inhibitors US Patent  US9758524 Publication Date 9/12/2017 
Target
Name:
Tyrosine-protein kinase Lck
Synonyms:
2.7.10.2 LCK_HUMAN Leukocyte C-terminal Src kinase Lymphocyte-specific protein tyrosine kinase Protein YT16 Proto-oncogene tyrosine-protein kinase LCK T cell-specific protein-tyrosine kinase
Type:
Mol. Mass.:
57987.83
Organism:
Homo sapiens (Human)
Description:
P06239
Residue:
509
  
Inhibitor
Name:
BDBM340085
Synonyms:
US10239883, Example 24 US9758524, Example 24
Type:
Small organic molecule
Emp. Form.:
C25H23N7O3
Mol. Mass.:
469.4952
SMILES:
CC#CC(=O)N1CCCC[C@H]1c1nc(-c2ccc(cc2)C(=O)Nc2ccon2)c2c(N)nccn12
: