Target
Complement factor D
Ligand
BDBM340211
Substrate
Meas. Tech.
Inhibition Assay
IC50
5500±n/a nM
Citation
 Wiles, JAPhadke, ASWang, XChen, DHashimoto, AGadhachanda, VRPais, GWang, QAgarwal, ADeshpande, M Compounds for treatment of complement mediated disorders US Patent  US9758537 Publication Date 9/12/2017 
Target
Name:
Complement factor D
Synonyms:
Adipsin CFAD_HUMAN DF Properdin factor D
Type:
Protein
Mol. Mass.:
27039.19
Organism:
Homo sapiens (Human)
Description:
P00746
Residue:
253
  
Inhibitor
Name:
BDBM340211
Synonyms:
3-((2S,4R)-2-(5-chloro- 1H-benzo[d]imidazol-2- yl)-4-fluoropyrrolidine- l-carboxamido)-1H- indole-1-carboxamide | US9758537, Compound 14
Type:
Small organic molecule
Emp. Form.:
C21H18ClFN6O2
Mol. Mass.:
440.858
SMILES:
NC(=O)n1cc(NC(=O)N2C[C@H](F)C[C@H]2c2nc3cc(Cl)ccc3[nH]2)c2ccccc12
: