Target
Complement factor D
Ligand
BDBM340212
Substrate
Meas. Tech.
Inhibition Assay
IC50
>10000±n/a nM
Citation
 Wiles, JAPhadke, ASWang, XChen, DHashimoto, AGadhachanda, VRPais, GWang, QAgarwal, ADeshpande, M Compounds for treatment of complement mediated disorders US Patent  US9758537 Publication Date 9/12/2017 
Target
Name:
Complement factor D
Synonyms:
Adipsin CFAD_HUMAN DF Properdin factor D
Type:
Protein
Mol. Mass.:
27039.19
Organism:
Homo sapiens (Human)
Description:
P00746
Residue:
253
  
Inhibitor
Name:
BDBM340212
Synonyms:
2-(3-acetyl-1H-indol-1- yl)-1-((2S,4R)-2-(5- chloro-1H- benzo[d]imidazol-2-yl)- 4-fluoropyrrolidin-1- yl)ethanone | US9758537, Compound 15
Type:
Small organic molecule
Emp. Form.:
C23H20ClFN4O2
Mol. Mass.:
438.882
SMILES:
CC(=O)c1cn(CC(=O)N2C[C@H](F)C[C@H]2c2nc3cc(Cl)ccc3[nH]2)c2ccccc12
: