Target
Complement factor D
Ligand
BDBM340252
Substrate
Meas. Tech.
Inhibition Assay
IC50
>10000±n/a nM
Citation
 Wiles, JAPhadke, ASWang, XChen, DHashimoto, AGadhachanda, VRPais, GWang, QAgarwal, ADeshpande, M Compounds for treatment of complement mediated disorders US Patent  US9758537 Publication Date 9/12/2017 
Target
Name:
Complement factor D
Synonyms:
Adipsin CFAD_HUMAN DF Properdin factor D
Type:
Protein
Mol. Mass.:
27039.19
Organism:
Homo sapiens (Human)
Description:
P00746
Residue:
253
  
Inhibitor
Name:
BDBM340252
Synonyms:
(2S,4R)-1-(2-(3-acetyl- 1H-indol-1- yl)propanoyl)-N-(3- chloro-2-fluorobenzyl)- 4-fluoropyrrolidine-2- carboxamide | US9758537, Compound 55
Type:
Small organic molecule
Emp. Form.:
C25H24ClF2N3O3
Mol. Mass.:
487.926
SMILES:
CC(C(=O)N1C[C@H](F)C[C@H]1C(=O)NCc1cccc(Cl)c1F)n1cc(C(C)=O)c2ccccc12
: